{"text_format":"1","workbook":"xlsx","n_sheets":4,"sheets":["selite","KEHIKKO","pohjatiedot","väestöennuste"],"not_rendered":{"charts":2,"images":0,"macros":0,"external_links":1,"defined_names":3,"comments":0,"pivot_tables":0},"unopened":[],"bounds":{"document_bytes":16777216,"sheet_cells":100000,"rows_first":2000,"rows_last":500,"rows_between":2000,"halvings":0,"cell_chars":16384,"cell_head_chars":4096},"cells_cut":0,"cells_raw":0,"read":"whole","date_system":"1900"}

{"sheet":"selite","index":0,"n_rows":69,"n_cols":8,"rows_kept":69,"cut":false,"hidden":false,"merged":[]}
["VALTIOVARAINMINISTERIÖ/Kunta- ja aluehallinto-osasto/vjl",null,null,null,null,null,null,"2017-10-30"]
[]
["KUNTAKONSERNIN TALOUDEN SUUNNITTELUKEHIKKO"]
[]
["Kehikon käyttötarkoitus:"]
["Vuorovaikutteinen kuntakonsernin talouden suunnittelun apuväline. Kehikon avulla voidaan suunnitella konsernin talouden"]
["kehitystä pidemmällä aikavälillä. Tarkastelun kohteena ovat konsernin tuloslaskelma, rahoituslaskelmasta rahavarat, antolainat ja"]
["investoinnit sekä taseesta lainat ja kertynyt yli-/alijäämä. Pohjatietoina kehikossa ovat 2 viimeksi "]
["valmistunutta tilinpäätöstä. "]
["Tulevan kehityksen osalta tuloslaskelman erien kasvuolettamukset pohjautuvat lähtökohtaisesti"]
["uusimman valtion kuntatalousohjelman (elokuu 2017) mukaisiin makroarviolukuihin - ei kuntakohtaisiin ennusteisiin. "]
["Käyttäjä voi kuitenkin itse muokata em. kasvuolettamuksia sekä yleensä tuloslaskelman muita eriä."]
["Myös tuloveroprosenttia, investointeja ja antolainasaamisten määrää voidaan muuttaa."]
["Rahoituslaskelman ja taseen erät pohjautuvat jäljempänä selostettuihin olettamuksiin"]
["(pl. taseen kertynyt yli-/alijäämä = ed. tilikausien yli-/alijäämä + tilikauden yli-/alijäämä)."]
[]
["Käyttäjä voi muokata vaaleansinisellä pohjalla olevia kohtia (soluja)."]
[]
["Kehikon laskentapohja:"]
["Asukasluku:"]
{"$rows_left_out":50}
{"sheet":"KEHIKKO","index":1,"n_rows":118,"n_cols":16,"rows_kept":118,"cut":false,"hidden":false,"merged":[]}
["Valtiovarainministeriö/Kunta- ja aluehallinto-osasto/vjl",null,null,null,null,null,null,"VALITSE KUNTA:",null,null,null,"2017-10-31"]
["KUNTAKONSERNIN TALOUDEN SUUNNITTELUKEHIKKO",null,null,null,null,null,null,null,null,"Kunnat vuoden 2017 kuntajaolla"]
["Muokkaa vaaleansinisellä olevia kohtia."]
[{"$f":"INDEX(pohjatiedot!$B$3:$B$298,KEHIKKO!$A$5)","v":"KOKO MAA (Manner-Suomi)"}]
[96,"TP 2015","TP 2016",2017,2018,2019,2020,2021,2022,2023,2024,2025,2026]
["TULOSLASKELMA",null,null,null,null,null,null,null,null,null,"sama kuin ed.vuonna"]
["Asukasluku 31.12.",{"$f":"VLOOKUP($A$4,pohjatiedot!$B$3:$CD$298,2)","v":5458325},{"$f":"VLOOKUP($A$4,pohjatiedot!$B$3:$CD$298,40)","v":5474083},{"$f":"VLOOKUP($A$4,väestöennuste!$A$8:$K$305,4)","v":5482281},{"$f":"VLOOKUP($A$4,väestöennuste!$A$8:$K$305,5)","v":5503261},{"$f":"VLOOKUP($A$4,väestöennuste!$A$8:$K$305,6)","v":5524063},{"$f":"VLOOKUP($A$4,väestöennuste!$A$8:$K$305,7)","v":5544619},{"$f":"VLOOKUP($A$4,väestöennuste!$A$8:$K$305,8)","v":5564874},{"$f":"VLOOKUP($A$4,väestöennuste!$A$8:$K$305,9)","v":5584791},{"$f":"VLOOKUP($A$4,väestöennuste!$A$8:$K$305,10)","v":5604290},{"$f":"VLOOKUP($A$4,väestöennuste!$A$8:$K$305,11)","v":5623257},{"$f":"K7","v":5623257},{"$f":"L7","v":5623257},"Väestöennuste TK 2015"]
["Veroprosentti",{"$f":"VLOOKUP($A$4,pohjatiedot!$B$3:$CD$298,3)","v":19.850000000000001},{"$f":"VLOOKUP($A$4,pohjatiedot!$B$3:$CD$298,41)","v":19.89},{"$f":"VLOOKUP($A$4,pohjatiedot!$B$3:$CG$298,81)","v":19.920000000000002},{"$f":"D8","v":19.920000000000002},{"$f":"E8","v":19.920000000000002},{"$f":"VLOOKUP($A$4,pohjatiedot!$B$3:$CG$298,81)","v":19.920000000000002},19.920000000000002,19.920000000000002,19.920000000000002,19.920000000000002,19.920000000000002,19.920000000000002,null,"Vuoden 2020 veroprosentti on saatu vähentämällä kunnilta 12,47 %-yksikköä"]
["vero-% yksikön tuotto",{"$f":"B15/B8","v":929129.42065491178},945567.82302664651,{"$f":"D15/D8","v":941785.55173453991},{"$f":"E15/E8","v":962504.83387269976},992342.48372275336,458462.22747991217,444249.89842803485,430478.15157676581,417133.32887788606,404202.19568267156,391671.92761650874,379530.09786039696]
[" → noston vaikutus",null,null,{"$f":"(D8-C8)*C9","v":28367.034690800469},{"$f":"(E8-D8)*D9","v":0},0,0,0,0,0,0,0,0]
["Toimintatuotot (sis. valm. okäytt.)",{"$f":"VLOOKUP($A$4,pohjatiedot!$B$3:$CD$298,6)","v":23476833},{"$f":"VLOOKUP($A$4,pohjatiedot!$B$3:$CD$298,44)","v":23891978},{"$f":"C11*(1+D70/100)","v":22960190.857999999},{"$f":"D11*(1+E70/100)","v":23143872.384863999},{"$f":"E11*(1+F70/100)","v":23537318.215406686},{"$f":"F11*(1+G70/100)","v":18782779.935894538},{"$f":"G11*(1+H70/100)","v":19271132.214227796},19772181.651797719,20286258.37474446,20813701.092487816,21354857.320892498,21910083.611235704,null,"Näiden erin muutos-"]
["Toimintakulut",{"$f":"VLOOKUP($A$4,pohjatiedot!$B$3:$CD$298,7)","v":49847855},{"$f":"VLOOKUP($A$4,pohjatiedot!$B$3:$CD$298,45)","v":50389944},{"$f":"C12*(1+D71/100)","v":49130195.399999999},49670627.549399994,50713710.727937393,24596149.703049634,25235649.595328923,25891776.484807476,26564962.673412472,27255651.702921197,27964298.64719715,28691370.412024274,null,"prosentit syötetään"]
["Osuus osakk.yht. voitoista/tappioista",{"$f":"VLOOKUP($A$4,pohjatiedot!$B$3:$CD$298,8)","v":59655},{"$f":"VLOOKUP($A$4,pohjatiedot!$B$3:$CD$298,46)","v":68081},{"$f":"C13","v":68081},{"$f":"D13","v":68081},{"$f":"E13","v":68081},68081,68081,68081,68081,68081,68081,68081,null,"alla olevaan taulukkoon"]
["Toimintakate",{"$f":"B11-B12+B13","v":-26311367},{"$f":"C11-C12+C13","v":-26429885},{"$f":"D11-D12+D13","v":-26101923.541999999},{"$f":"E11-E12+E13","v":-26458674.164535996},-27108311.512530707,-5745288.7671550959,-5896436.3811011277,-6051513.8330097571,-6210623.298668012,-6373869.6104333811,-6541360.3263046518,-6713205.8007885702]
["Kunnallisverot",{"$f":"VLOOKUP($A$4,pohjatiedot!$B$3:$CD$298,9)","v":18443219},{"$f":"VLOOKUP($A$4,pohjatiedot!$B$3:$CD$298,47)","v":18807344},{"$f":"(C15+D10)*(1+D72/100)","v":18760368.190552037},{"$f":"(D15+E10)*(1+E72/100)","v":19173096.290744182},{"$f":"(E15+F10)*(1+F72/100)","v":19767462.275757249},{"$f":"F15*(1+G72/100)","v":9132567.5713998508},{"$f":"(G15+H10)*(1+H72/100)","v":8849457.9766864553},{"$f":"(H15+I10)*(1+I72/100)","v":8575124.7794091757},8309295.9112474909,8051707.737998818,7802104.7981208544,7560239.5493791075]
["Yhteisöverot  ",{"$f":"VLOOKUP($A$4,pohjatiedot!$B$3:$CD$298,10)","v":1638497},{"$f":"VLOOKUP($A$4,pohjatiedot!$B$3:$CD$298,48)","v":1539341},{"$f":"C16*(1+D73/100)","v":1898007.4530000002},{"$f":"D16*(1+E73/100)","v":1930273.5797010001},1984321.2399326281,1623174.77426489,1485204.9184523744,1358962.5003839226,1243450.6878512893,1137757.3793839298,1041048.0021362958,952558.92195471062]
["Kiinteistöverot",{"$f":"VLOOKUP($A$4,pohjatiedot!$B$3:$CD$298,11)","v":1581155},{"$f":"VLOOKUP($A$4,pohjatiedot!$B$3:$CD$298,49)","v":1640918},{"$f":"C17*(1+D74/100)","v":1721322.9819999998},1779847.9633879999,1836803.0982164158,1860681.5384932291,1881149.0354166543,1901841.6748062372,1922761.9332291055,1943912.3144946254,1965295.3499540661,1986913.5988035607]
["Verotulot",{"$f":"VLOOKUP($A$4,pohjatiedot!$B$3:$CD$298,12)","v":21662871},{"$f":"VLOOKUP($A$4,pohjatiedot!$B$3:$CD$298,50)","v":21987603},{"$f":"SUM(D15:D17)","v":22379698.62555204},22883217.83383318,23588586.61390629,12616423.884157971,12215811.930555485,11835928.954599336,11475508.532327885,11133377.431877373,10808448.150211217,10499712.07013738]
["Valtionosuudet",{"$f":"VLOOKUP($A$4,pohjatiedot!$B$3:$CD$298,13)","v":9442539},{"$f":"VLOOKUP($A$4,pohjatiedot!$B$3:$CD$298,51)","v":10050212},{"$f":"C19*(1+D75/100)","v":9979860.5160000008},{"$f":"D19*(1+E75/100)","v":9730364.0031000003},{"$f":"E19*(1+F75/100)","v":9350879.8069790993},{"$f":"F19*(1+G75/100)","v":2739807.7834448754},{"$f":"G19*(1+H75/100)","v":2824741.8247316661},2912308.8212983473,3002590.3947585956,3095670.6969961119,3191636.4886029912,3290577.2197496835]
[null,null,null,"Kuntatalousohjelma-->"]
{"$rows_left_out":99}
{"sheet":"pohjatiedot","index":2,"n_rows":298,"n_cols":101,"rows_kept":298,"cut":false,"hidden":false,"merged":[]}
[null,null,2015,41,42,43,44,45,46,47,48,49,50,51,52,53,54,55,56,57,58,59,60,61,62,63,64,65,66,67,68,69,70,71,72,73,74,75,76,77,2016,41,42,43,44,45,46,47,48,49,50,51,52,53,54,55,56,57,58,59,60,61,62,63,64,65,65,66,68,68,69,70,71,72,73,74,76,null,77,78,"vero-%","vero-%",12.47,null,null,2016,2016,2010,85,2017,2018,89,90,91,92,2013,"2016, rivi 96",2016,90,91,2015]
["Kunta nro.","Kunta","Asukasluku ","Veroprosentti","vero-% yksikön tuotto"," -> noston vaikutus","Toimintatuotot","Toimintakulut","Osuus osakkuusyhteisöjen voitoista/tappioista","Kunnallisverot","Yhteisöverot","Kiinteistöverot","Verotulot","Valtionavut","Korkotuotot","Korkokulut","Muut rahoitustuotot","Muut rahoituskulut","VUOSIKATE"," €/as","Poistot ja arvonalent.","Satunnaiset erät",null,"Tlikauden tulos","Tilinpäätössiirrot","Vähemmintösiirrot",null,"Tlikauden yli-/alijäämä","€/as","Kertynyt yli-/alijäämä","€/as",null,"Nettoinv.","Vuosikate-nettoinv.","€/as","Rahavarat (ent. kassavarat)","€/as","Lainakanta ","€/as","Saamiset","Asukasluku","Veroprosentti","vero-% yksikön tuotto"," -> noston vaikutus","Toimintatuotot","Toimintakulut","Osuus osakkuusyhteisöjen voitoista/tappioista","Kunnallisverot","Yhteisöverot","Kiinteistöverot","Verotulot","Valtionavut","Korkotuotot","Korkokulut","Muut rahoitustuotot","Muut rahoituskulut","VUOSIKATE"," €/as","Poistot ja arvonalent.","Satunnaiset erät",null,"Tlikauden tulos","Tilinpäätössiirrot","Tilikauden verot","Lask. verot","Vähemmistöosuudet","Tlikauden yli-/alijäämä","€/as","Kertynyt yli-/alijäämä","€/as",null,"Nettoinv.","Vuosikate-nettoinv.","€/as","Rahavarat ","€/as","Lainakanta ","€/as","Saamiset",null,null,2017,2020,null,null,"vos-hava","hava","vos-hava","Harkvar10","Valtionosuudet","Valtionosuudet",null,null,null,"vos-hava 2015","Kotikuntakorv+elatustuen palautus, netto","Tulorah.korjauserät","Investointimenot","Rahoitusos. inv.menoihin","Inv.hyödyk. luovutustulot","antolainauksen muutokset"]
[20,"Akaa",17043,21.25,null,null,57367,144558,0,54123,1775,3194,59092,32589,385,814,287,387,3961,null,6334,0,null,-2373,-24,-30,null,-2427,null,-8757,null,null,-10059,null,null,5118,null,70056,null,null,16923,21.25,null,null,57740,143891,22,55165,1606,3377,60148,34067,374,691,287,155,7901,null,7116,98,null,883,9,73,-46,-84,689,null,-7699,null,null,null,null,null,9534,null,70428,null,null,null,null,21.25,{"$f":"CD3-$CE$1","v":8.7799999999999994},null,null,null,null,27814,0,30572.896963830583,29351.912102991082,null,{"$f":"CM3-CN3","v":29351.912102991082},null,{"$f":"N3-CP3","v":32589},-322.96222939400002,-165,-6421,394,473,-63]
[5,"Alajärvi",10006,21.5,null,null,66627,124182,91,24150,2048,2256,28454,36816,27,527,157,43,7420,null,4849,-38,null,2533,-94,-130,null,2309,null,-783,null,null,-3719,null,null,10662,null,41488,null,null,9899,22,null,null,66345,123039,77,25084,2039,2313,29436,39395,21,498,185,128,11794,null,4798,0,null,6996,83,68,-9,-65,6937,null,5760,null,null,null,null,null,9170,null,38620,null,null,null,null,21.75,{"$f":"CD4-$CE$1","v":9.2799999999999994},null,null,null,null,30121,0,35696.984931790576,34318.375302499961,null,{"$f":"CM4-CN4","v":34318.375302499961},null,{"$f":"N4-CP4","v":36816},4798.4155228000009,-145,-11502,134,2039,22]
[9,"Alavieska",2687,21.5,null,null,16292,31617,3,7099,285,408,7792,9346,1,78,24,15,1746,null,1149,0,null,597,0,0,null,597,null,-508,null,null,-931,null,null,478,null,13050,null,null,2639,21.5,null,null,16234,32053,0,6892,271,522,7685,9849,1,51,24,18,1669,null,1054,681,null,1296,0,-1,-1,-1,1295,null,329,null,null,null,null,null,1978,null,10838,null,null,null,null,21.5,9.0299999999999994,null,null,null,null,7636,0,8918.4021211721301,8666.7788811986575,null,8666.7788811986575,null,{"$f":"N5-CP5","v":9346},-54.915172200000015,3,-815,9,281,16]
[10,"Alavus",12044,20.75,null,null,51581,118452,30,29182,2245,2588,34015,37398,100,711,863,-57,4880,null,6038,0,null,-1158,-26,-29,null,-1213,null,9493,null,null,-13067,null,null,15434,null,60717,null,null,11907,21.25,null,null,64883,130531,541,29668,2203,2611,34482,38870,20,469,939,-10,8639,null,6022,0,null,2617,-12,6,-50,-34,2515,null,12545,null,null,null,null,null,15871,null,69825,null,null,null,null,21.25,8.7799999999999994,null,null,null,null,24410,0,38667.828399451791,37624.463588470207,null,37624.463588470207,null,37398,-117.78744078000003,-262,-12793,546,1981,-418]
[16,"Asikkala",8287,20.75,null,null,30917,71353,-14,25339,1538,2501,29378,16868,8,314,48,187,5351,null,3865,-30,null,1456,-22,0,null,1434,null,4148,null,null,-3657,null,null,4094,null,31761,null,null,8323,20.75,null,null,31656,71447,4,25836,1430,2659,29925,17906,8,184,238,409,7698,null,4014,-6,null,3678,-1,0,-81,0,3596,null,7509,null,null,null,null,null,3141,null,28449,null,null,null,null,20.75,8.2799999999999994,null,null,null,null,15106,0,17874.508686845202,17540.251548889391,null,17540.251548889391,null,16868,405.30136615999982,-97,-4015,231,392,-85]
[18,"Askola",5104,20.25,null,null,14479,38746,-1,16391,987,1052,18430,6844,3,202,297,50,1054,null,1780,0,null,-726,89,0,null,-637,null,-2084,null,null,-3010,null,null,2033,null,21513,null,null,5046,20.25,null,null,14258,39091,0,17262,868,1044,19174,7136,0,192,265,49,1501,null,1892,0,null,-391,93,0,0,0,-298,null,-2045,null,null,null,null,null,1720,null,21697,null,null,null,null,20.75,8.2799999999999994,null,null,null,null,5973,0,7397.7858976601101,7458.1080757415002,null,7458.1080757415002,null,6844,582.89778020000017,-153,-2567,2,281,0]
[19,"Aura",3986,21,null,null,12423,30335,1,12633,506,736,13875,5377,3,127,25,9,1233,null,1289,0,null,-56,0,-35,null,-91,null,-1894,null,null,-1788,null,null,1215,null,21599,null,null,3984,21.75,null,null,12522,30312,0,13272,758,410,14440,6032,2,68,15,3,2628,null,1259,0,null,1369,0,0,0,-49,1320,null,-543,null,null,null,null,null,1194,null,16296,null,null,null,null,21.75,9.2799999999999994,null,null,null,null,4924,0,5986.1344989335448,5584.2465923015225,null,5584.2465923015225,null,5377,-121.37373774000001,-7,-958,3,48,0]
[46,"Enonkoski",1473,21,null,null,9643,18560,0,3801,606,418,4825,5096,11,34,229,6,1204,null,802,-65,null,337,0,0,null,337,null,5610,null,null,-535,null,null,3223,null,1471,null,null,1453,21,null,null,9399,17959,0,3570,550,424,4544,5227,11,24,214,2,1410,null,780,-65,null,565,-79,0,9,0,495,null,6061,null,null,null,null,null,3334,null,1164,null,null,null,null,21,8.5299999999999994,null,null,null,null,4469,0,5272.4930687586148,5110.4539175955097,null,5110.4539175955097,null,5096,128.25992600000001,-1,-787,73,68,82]
[47,"Enontekiö",1861,20.75,null,null,3569,17395,6,4863,338,822,6023,8833,13,217,655,226,1261,null,1198,5,null,68,-74,-4,null,-10,null,-107,null,null,-2116,null,null,3417,null,12005,null,null,1872,21.25,null,null,2936,16836,-4,5003,326,822,6151,8935,104,186,545,279,1366,null,1108,0,null,258,0,0,2,-1,259,null,576,null,null,null,null,null,2879,null,11675,null,null,null,null,21.25,8.7799999999999994,null,null,null,null,7672,0,8847.6778030030855,8708.0230920612867,null,8708.0230920612867,null,8833,-10.086460199999998,0,-3331,1021,80,0]
[49,"Espoo",269802,18,null,null,954496,2193314,692,1161281,136157,96364,1393802,84376,12923,40269,49200,15679,246227,null,220614,0,null,25613,39148,-42,null,64719,null,558885,null,null,-691927,null,null,893963,null,2698010,null,null,274583,18,null,null,982749,2234818,-2334,1226153,120589,99740,1446482,116040,12945,43692,25100,4973,297500,null,237379,13541,null,73662,60,1649,10,29,72112,null,629653,null,null,null,null,null,1033578,null,3186678,null,null,null,null,18,5.5299999999999994,null,null,null,null,24390,0,35423.51400928435,29148.660299252388,null,29148.660299252388,null,84376,-12421.988776004002,-37572,-726495,30414,63963,1491]
[50,"Eura",12128,20.5,null,null,36066,102621,-44,40489,2540,2262,45291,26854,3,787,1227,24,5965,null,5645,0,null,320,-102,-125,null,93,null,3737,null,null,-8996,null,null,5908,null,53290,null,null,12004,20.5,null,null,35238,100185,0,38341,2183,3129,43653,27037,7,710,1222,14,6248,null,5435,0,null,813,0,1,-127,-43,642,null,4004,null,null,null,null,null,5971,null,54035,null,null,null,null,20.5,8.0299999999999994,null,null,null,null,22268,0,23934.034289951676,22959.415180906744,null,22959.415180906744,null,26854,68.71245356,-149,-6501,87,-13,315]
[51,"Eurajoki",5938,18,null,null,23606,58773,-2,16365,2179,16002,34546,8207,189,65,2789,1707,8786,null,3763,-2,null,5021,0,-2,null,5019,null,68463,null,null,-10730,null,null,22655,null,5640,null,null,9418,18,null,null,21029,59307,-6,18489,1426,18126,38041,8609,110,39,1129,398,9163,null,4275,3,null,4891,0,1,-6,2,4886,null,73485,null,null,null,null,null,24633,null,3694,null,null,null,null,18,5.5299999999999994,null,null,null,null,5750,0,13206.549841220543,11167.549277070151,null,11167.549277070151,null,8207,-34.227966854000002,-29,-8307,16,273,16]
[52,"Evijärvi",2576,21.5,null,null,7223,23615,7,7048,1099,730,8877,8406,60,47,48,11,948,null,798,0,null,150,-32,-6,null,112,null,3263,null,null,-925,null,null,6910,null,5899,null,null,2535,21.5,null,null,7088,23575,4,6961,933,721,8615,8566,197,26,58,23,904,null,834,0,null,70,-30,6,-2,-7,25,null,3286,null,null,null,null,null,6655,null,6210,null,null,null,null,21.5,9.0299999999999994,null,null,null,null,7542,0,8103.2899261589409,8180.3979916942644,null,8180.3979916942644,null,8406,57.281132000000014,0,-1216,9,10,15]
[61,"Forssa",17422,20,null,null,73086,166775,117,51849,3453,4376,59678,45264,92,921,133,14,10660,null,9067,0,null,1593,-119,66,null,1540,null,20111,null,null,-10741,null,null,17881,null,64164,null,null,17332,20,null,null,73748,166829,56,51886,3143,5379,60408,47018,51,673,199,45,13933,null,8501,0,null,5432,171,7,-47,94,5643,null,24755,null,null,null,null,null,19683,null,60008,null,null,null,null,20.5,8.0299999999999994,null,null,null,null,30500,0,40176.394675010488,39480.900657952698,null,39480.900657952698,null,45264,221.44138486000003,-1668,-16789,51,159,31]
[69,"Haapajärvi",7438,22,null,null,44549,86667,15,20055,1353,1843,23251,23465,26,607,2104,166,5870,null,3524,0,null,2346,29,-167,null,2208,null,5800,null,null,-3465,null,null,20715,null,38778,null,null,7332,22,null,null,40616,87803,19,19865,1382,1889,23136,27083,15,516,1264,186,3529,null,3603,-259,null,-333,-2,89,19,-53,-458,null,4756,null,null,null,null,null,20007,null,42099,null,null,null,null,22,9.5299999999999994,null,null,null,null,21546,0,23664.460169336282,23000.310845673146,null,23000.310845673146,null,23465,66.495922799999974,119,-6533,489,86,67]
[71,"Haapavesi",7167,21.25,null,null,51216,91724,12,18583,1218,1399,21200,22107,68,433,687,124,3009,null,4062,-19,null,-1072,-4,2,null,-1074,null,320,null,null,-4743,null,null,11503,null,45288,null,null,7098,22,null,null,52007,93366,1,18139,1146,1521,20806,22953,57,327,374,194,2310,null,3844,0,null,-1534,-4,0,-40,-1,-1579,null,-1575,null,null,null,null,null,11738,null,48554,null,null,null,null,22,9.5299999999999994,null,null,null,null,19865,0,24033.385262004795,23689.694250044173,null,23689.694250044173,null,22107,12.203371600000013,92,-6169,1991,41,-10]
[72,"Hailuoto",993,20,null,null,4724,11068,3,3048,94,291,3433,3703,4,13,60,4,841,null,686,0,null,155,2,0,null,157,null,6657,null,null,-606,null,null,3407,null,2827,null,null,994,20,null,null,4977,11338,0,2916,93,326,3335,3647,14,23,3,1,615,null,685,0,null,-70,-1,0,-1,-1,-73,null,6621,null,null,null,null,null,2661,null,3392,null,null,null,null,20,7.5299999999999994,null,null,null,null,3147,0,3476.3868461876737,3281.9833900359199,null,3281.9833900359199,null,3703,0,-30,-1437,250,68,-1]
[74,"Halsua",1225,21.5,null,null,5561,13200,18,3114,428,295,3837,4417,22,190,23,0,489,null,613,-14,null,-138,-94,0,null,-232,null,2237,null,null,-6638,null,null,1743,null,13630,null,null,1219,21.5,null,null,5581,13051,34,2891,315,443,3649,4633,10,153,25,1,727,null,774,-4,null,-51,1,3,2,-3,-54,null,2337,null,null,null,null,null,1426,null,13613,null,null,null,null,22,9.5299999999999994,null,null,null,null,3768,0,4156.0472573350735,4173.2283887804433,null,4173.2283887804433,null,4417,22.414356000000002,-28,-590,0,41,-10]
{"$rows_left_out":279}
{"sheet":"väestöennuste","index":3,"n_rows":303,"n_cols":11,"rows_kept":303,"cut":false,"hidden":false,"merged":[]}
["Väestöennuste 2015 kunnittain 2017-2024"]
["TK, 28.9.2015"]
["2017 kuntajako",3,4,6,7,8,9,10,11,12,13]
[]
[null,2015,2016,2017,2018,2019,2020,2021,2022,2023,2024]
[]
[]
["Akaa",{"$f":"pohjatiedot!C3","v":17043},{"$f":"pohjatiedot!AO3","v":16923},17070,17092,17116,17150,17184,17218,17248,17275]
["Alajärvi",{"$f":"pohjatiedot!C4","v":10006},{"$f":"pohjatiedot!AO4","v":9899},10001,9923,9845,9769,9697,9629,9560,9499]
["Alavieska",{"$f":"pohjatiedot!C5","v":2687},{"$f":"pohjatiedot!AO5","v":2639},2650,2631,2615,2599,2586,2572,2560,2549]
["Alavus",{"$f":"pohjatiedot!C6","v":12044},{"$f":"pohjatiedot!AO6","v":11907},11877,11780,11689,11605,11527,11454,11384,11319]
["Asikkala",{"$f":"pohjatiedot!C7","v":8287},{"$f":"pohjatiedot!AO7","v":8323},8294,8262,8239,8219,8200,8184,8172,8159]
["Askola",{"$f":"pohjatiedot!C8","v":5104},{"$f":"pohjatiedot!AO8","v":5046},5169,5220,5270,5320,5365,5410,5449,5490]
["Aura",{"$f":"pohjatiedot!C9","v":3986},{"$f":"pohjatiedot!AO9","v":3984},4035,4058,4079,4099,4118,4134,4152,4168]
["Enonkoski",{"$f":"pohjatiedot!C10","v":1473},{"$f":"pohjatiedot!AO10","v":1453},1462,1445,1430,1416,1401,1388,1375,1363]
["Enontekiö",{"$f":"pohjatiedot!C11","v":1861},{"$f":"pohjatiedot!AO11","v":1872},1896,1902,1910,1917,1926,1936,1945,1956]
["Espoo",{"$f":"pohjatiedot!C12","v":269802},{"$f":"pohjatiedot!AO12","v":274583},273484,277445,281312,285087,288763,292333,295784,299117]
["Eura",{"$f":"pohjatiedot!C13","v":12128},{"$f":"pohjatiedot!AO13","v":12004},12205,12166,12127,12091,12059,12028,11995,11960]
["Eurajoki",{"$f":"pohjatiedot!C14","v":5938},{"$f":"pohjatiedot!AO14","v":9418},5964,5972,5984,5995,6007,6016,6024,6029]
["Evijärvi",{"$f":"pohjatiedot!C15","v":2576},{"$f":"pohjatiedot!AO15","v":2535},2596,2571,2548,2528,2510,2492,2474,2458]
{"$rows_left_out":283}